{"text_format":"1","workbook":"xlsx","n_sheets":4,"sheets":["Instructions et définitions","Compilation des données","Rapports","TDC"],"not_rendered":{"charts":6,"images":6,"macros":1,"external_links":0,"defined_names":2,"comments":1,"pivot_tables":6},"unopened":[],"bounds":{"document_bytes":16777216,"sheet_cells":100000,"rows_first":2000,"rows_last":500,"rows_between":2000,"halvings":0,"cell_chars":16384,"cell_head_chars":4096},"cells_cut":0,"cells_raw":0,"read":"whole","date_system":"1900"}

{"sheet":"Instructions et définitions","index":0,"n_rows":40,"n_cols":23,"rows_kept":40,"cut":false,"hidden":false,"merged":[[4,10,4,12],[4,6,4,8],[0,0,0,14],[4,1,4,4]]}
["Outil d’aide à la compilation des données de fertilité"]
[]
[null,null,"Entrée des paramètres de base et définitions"]
[]
[null,"Nom (ID) des groupes d'accouplements",null,null,null,null,"Race/croisement",null,null,null,"Période de contre-saison",null,null,null,null,null,null,null,"Ma période de contre saison"]
[null,null,"  * Écrivez vos groupes en abrégé",null,null,null,"* Utilisez des abréviations",null,null,null,null,"  * Faites un ''X''",null,null,null,null,null,null,"Faire un X","no.","mois","S ou CS"]
[null,null,1,"Gr. A (exemple)",null,null,null,"RV",null,null,"Janvier",null,null,null,null,null,null,null,{"$f":"'Instructions et définitions'!L7","v":0},1,{"$f":"IF(S7=\"x\",W7,\"\")","v":""},{"$f":"IF(S7=\"x\",\"CS\",\"S\")","v":"S"},"Janvier"]
[null,null,2,null,null,null,null,"SU",null,null,"Février",null,null,null,null,null,null,null,{"$f":"'Instructions et définitions'!L8","v":0},2,"","S","Février"]
[null,null,3,null,null,null,null,"DP",null,null,"Mars",null,null,null,null,null,null,null,{"$f":"'Instructions et définitions'!L9","v":0},3,"","S","Mars"]
[null,null,4,null,null,null,null,"RI",null,null,"Avril","x",null,null,null,null,null,null,{"$f":"'Instructions et définitions'!L10","v":"x"},4,"Avril","CS","Avril"]
[null,null,5,null,null,null,null,null,null,null,"Mai","x",null,null,null,null,null,null,{"$f":"'Instructions et définitions'!L11","v":"x"},5,"Mai","CS","Mai"]
[null,null,6,null,null,null,null,null,null,null,"Juin","x",null,null,null,null,null,null,{"$f":"'Instructions et définitions'!L12","v":"x"},6,"Juin","CS","Juin"]
[null,null,7,null,null,null,null,null,null,null,"Juillet","x",null,null,null,null,null,null,{"$f":"'Instructions et définitions'!L13","v":"x"},7,"Juillet","CS","Juillet"]
[null,null,8,null,null,null,null,null,null,null,"Août","x",null,null,null,null,null,null,{"$f":"'Instructions et définitions'!L14","v":"x"},8,"Août","CS","Août"]
[null,null,9,null,null,null,null,null,null,null,"Sept.",null,null,null,null,null,null,null,{"$f":"'Instructions et définitions'!L15","v":0},9,"","S","Septembre"]
[null,null,10,null,null,null,null,null,null,null,"Oct.",null,null,null,null,null,null,null,{"$f":"'Instructions et définitions'!L16","v":0},10,"","S","Octobre"]
[null,null,11,null,null,null,null,null,null,null,"Nov.",null,null,null,null,null,null,null,{"$f":"'Instructions et définitions'!L17","v":0},11,"","S","Novembre"]
[null,null,12,null,null,null,null,null,null,null,"Déc.",null,null,null,null,null,null,null,{"$f":"'Instructions et définitions'!L18","v":0},12,"","S","Décembre"]
[null,null,13]
[null,null,14]
[null,null,15]
[null,null,16]
[null,null,17]
[null,null,18]
[null,null,19]
[null,null,20]
[null,null,21]
[null,null,22]
[null,null,23,null,null,null,null,"Pour nous contacter:"]
[null,null,24,null,null,null,null,"François Castonguay:",null,null,"Francois.Castonguay@fsaa.ulaval.ca"]
[null,null,25,null,null,null,null,"Pierre-Luc Faucher: ",null,null,"pierre-luc.faucher.4@ulaval.ca"]
[]
[]
[null,null,null,"Terme","Définition"]
[]
[null,null,null,"Femelle transférée","Une femelle qui n'était pas gestante à une échographie et qui a été transférée dans un autre groupe d'accouplement"]
[null,null,null,"Femelle du groupe d'origine","Une femelle qui est restée dans son groupe de régie d’origine (qui ne provient pas d’un transfert de groupe)."]
[null,null,null,"Taux de gestation à l'échographie","Nombre de femelles gestantes (positives) à l'échographie/Nombre total de femelles à l'échographie (selon les types de femelles)"]
[null,null,null,"Taux de gestation moyen","Taux de gestation global d'un groupe d'accouplement incluant tous les types de femelles (brebis et agnelles, transférées ou non)"]
[null,null,null,"Méthode de reproduction (transférée)","Correspond à la méthode d'accouplement utilisée pour les femelles transférées."]
{"$rows_left_out":1}
{"sheet":"Compilation des données","index":1,"n_rows":66,"n_cols":33,"rows_kept":66,"cut":false,"hidden":false,"merged":[[2,13,2,27],[3,14,3,19],[4,28,4,30],[4,14,4,16],[4,17,4,19],[4,24,4,26],[3,20,3,26],[4,21,4,23]]}
[]
[null,null,null,null,"case bleu : à compléter",null,null,null,null,"CS","Contre-saison"]
[null,null,null,null,"case blanche : non modifiable",null,null,null,null,"S","Saison",null,null,"Échographie"]
[null,null,null,null,null,null,null,null,null,null,null,null,null,null,"Femelles du groupe d'origine",null,null,null,null,null,"Femelles transférées"]
[null,null,null," ",null,null,null,null,null,null,null,null,null,null,"Brebis",null,null,"Agnelles",null,null,null,"Brebis",null,null,"Agnelles",null,null,null,"Femelles à transférer"]
[null," .","tri valide","ID groupe accouplement","Race /croisement","Date accouplement (aaaa-mm-jj)","Année","Mois","Mois brut","Saison long","vide","Saison","Méthode de reproduction (origine)","Date       (aaaa-mm-jj)","Nbre total","Nbre positives","Taux gestation (brebis)","Nbre total","Nbre positives","Taux gestation (agnelles)","Méthode de reproduction (transférées)","Nbre total","Nbre positives","Taux gestation (brebis transférées)","Nbre total","Nbre positives","Taux gestation (agnelles transférées)","Taux gestation moyen","Nbre brebis ","Nbre agnelles ","Transfert dans le groupe","vide","Notes"]
[null,1,{"$f":"IF(F7>1,TRUE)","v":true},"Gr. A (exemple)","RV","2019-04-01",{"$f":"IF(YEAR(F7)>1901,YEAR(F7))","v":2019},{"$f":"IF(C7=TRUE,MONTH(F7),\"\")","v":4},{"$f":"VLOOKUP(H7,'Instructions et définitions'!$T$7:$W$18,4,FALSE)","v":"Avril"},{"$f":"IFERROR(VLOOKUP(L7,$J$2:$K$3,2,FALSE),\"\")","v":"Contre-saison"},null,{"$f":"IFERROR(VLOOKUP(H7,'Instructions et définitions'!$T$7:$V$18,3,FALSE),\"\")","v":"CS"},"Effet bélier","2016-07-18",50,46,{"$f":"IFERROR(P7/O7,\"\")","v":0.92},48,46,{"$f":"IFERROR(S7/R7,\"\")","v":0.95833333333333337},"CIDR",10,8,{"$f":"IFERROR(W7/V7,\"\")","v":0.8},6,3,{"$f":"IFERROR(Z7/Y7,\"\")","v":0.5},{"$f":"IFERROR((P7+S7+W7+Z7)/(O7+R7+V7+Y7),\"\")","v":0.90350877192982459},6,5,"Gr. B"]
[null,2,{"$f":"IF(F8>1,TRUE)","v":false},null,null,null,false,"",{"$f":"VLOOKUP(H8,'Instructions et définitions'!$T$7:$W$18,4,FALSE)","v":{"$error":"#N/A"}},{"$f":"IFERROR(VLOOKUP(L8,$J$2:$K$3,2,FALSE),\"\")","v":""},null,{"$f":"IFERROR(VLOOKUP(H8,'Instructions et définitions'!$T$7:$V$18,3,FALSE),\"\")","v":""},null,null,null,null,{"$f":"IFERROR(P8/O8,\"\")","v":""},null,null,{"$f":"IFERROR(S8/R8,\"\")","v":""},null,null,null,{"$f":"IFERROR(W8/V8,\"\")","v":""},null,null,"",""]
[null,3,false,null,null,null,false,"",{"$f":"VLOOKUP(H9,'Instructions et définitions'!$T$7:$W$18,4,FALSE)","v":{"$error":"#N/A"}},"",null,{"$f":"IFERROR(VLOOKUP(H9,'Instructions et définitions'!$T$7:$V$18,3,FALSE),\"\")","v":""},null,null,null,null,{"$f":"IFERROR(P9/O9,\"\")","v":""},null,null,"",null,null,null,"",null,null,"",""]
[null,4,false,null,null,null,false,"",{"$f":"VLOOKUP(H10,'Instructions et définitions'!$T$7:$W$18,4,FALSE)","v":{"$error":"#N/A"}},"",null,{"$f":"IFERROR(VLOOKUP(H10,'Instructions et définitions'!$T$7:$V$18,3,FALSE),\"\")","v":""},null,null,null,null,{"$f":"IFERROR(P10/O10,\"\")","v":""},null,null,"",null,null,null,"",null,null,"",""]
[null,5,false,null,null,null,false,"",{"$f":"VLOOKUP(H11,'Instructions et définitions'!$T$7:$W$18,4,FALSE)","v":{"$error":"#N/A"}},"",null,{"$f":"IFERROR(VLOOKUP(H11,'Instructions et définitions'!$T$7:$V$18,3,FALSE),\"\")","v":""},null,null,null,null,"",null,null,"",null,null,null,"",null,null,"",""]
[null,6,false,null,null,null,false,"",{"$f":"VLOOKUP(H12,'Instructions et définitions'!$T$7:$W$18,4,FALSE)","v":{"$error":"#N/A"}},"",null,{"$f":"IFERROR(VLOOKUP(H12,'Instructions et définitions'!$T$7:$V$18,3,FALSE),\"\")","v":""},null,null,null,null,"",null,null,"",null,null,null,"",null,null,"",""]
[null,7,false,null,null,null,false,"",{"$f":"VLOOKUP(H13,'Instructions et définitions'!$T$7:$W$18,4,FALSE)","v":{"$error":"#N/A"}},"",null,{"$f":"IFERROR(VLOOKUP(H13,'Instructions et définitions'!$T$7:$V$18,3,FALSE),\"\")","v":""},null,null,null,null,"",null,null,"",null,null,null,"",null,null,{"$f":"IFERROR(Z13/Y13,\"\")","v":""},{"$f":"IFERROR((P13+S13+W13+Z13)/(O13+R13+V13+Y13),\"\")","v":""}]
[null,8,false,null,null,null,false,"",{"$f":"VLOOKUP(H14,'Instructions et définitions'!$T$7:$W$18,4,FALSE)","v":{"$error":"#N/A"}},"",null,{"$f":"IFERROR(VLOOKUP(H14,'Instructions et définitions'!$T$7:$V$18,3,FALSE),\"\")","v":""},null,null,null,null,"",null,null,"",null,null,null,"",null,null,"",""]
[null,9,false,null,null,null,false,"",{"$f":"VLOOKUP(H15,'Instructions et définitions'!$T$7:$W$18,4,FALSE)","v":{"$error":"#N/A"}},"",null,{"$f":"IFERROR(VLOOKUP(H15,'Instructions et définitions'!$T$7:$V$18,3,FALSE),\"\")","v":""},null,null,null,null,"",null,null,"",null,null,null,"",null,null,"",""]
[null,10,false,null,null,null,false,"",{"$f":"VLOOKUP(H16,'Instructions et définitions'!$T$7:$W$18,4,FALSE)","v":{"$error":"#N/A"}},"",null,{"$f":"IFERROR(VLOOKUP(H16,'Instructions et définitions'!$T$7:$V$18,3,FALSE),\"\")","v":""},null,null,null,null,"",null,null,"",null,null,null,"",null,null,"",""]
[null,11,false,null,null,null,{"$f":"IF(YEAR(F17)>1901,YEAR(F17))","v":false},{"$f":"IF(C17=TRUE,MONTH(F17),\"\")","v":""},{"$f":"VLOOKUP(H17,'Instructions et définitions'!$T$7:$W$18,4,FALSE)","v":{"$error":"#N/A"}},"",null,{"$f":"IFERROR(VLOOKUP(H17,'Instructions et définitions'!$T$7:$V$18,3,FALSE),\"\")","v":""},null,null,null,null,"",null,null,"",null,null,null,"",null,null,"",""]
[null,12,false,null,null,null,false,"",{"$f":"VLOOKUP(H18,'Instructions et définitions'!$T$7:$W$18,4,FALSE)","v":{"$error":"#N/A"}},"",null,{"$f":"IFERROR(VLOOKUP(H18,'Instructions et définitions'!$T$7:$V$18,3,FALSE),\"\")","v":""},null,null,null,null,"",null,null,"",null,null,null,"",null,null,"",""]
[null,13,false,null,null,null,false,"",{"$f":"VLOOKUP(H19,'Instructions et définitions'!$T$7:$W$18,4,FALSE)","v":{"$error":"#N/A"}},"",null,{"$f":"IFERROR(VLOOKUP(H19,'Instructions et définitions'!$T$7:$V$18,3,FALSE),\"\")","v":""},null,null,null,null,"",null,null,"",null,null,null,"",null,null,"",""]
[null,14,false,null,null,null,false,"",{"$f":"VLOOKUP(H20,'Instructions et définitions'!$T$7:$W$18,4,FALSE)","v":{"$error":"#N/A"}},"",null,{"$f":"IFERROR(VLOOKUP(H20,'Instructions et définitions'!$T$7:$V$18,3,FALSE),\"\")","v":""},null,null,null,null,"",null,null,"",null,null,null,"",null,null,"",""]
[null,15,false,null,null,null,false,"",{"$f":"VLOOKUP(H21,'Instructions et définitions'!$T$7:$W$18,4,FALSE)","v":{"$error":"#N/A"}},"",null,{"$f":"IFERROR(VLOOKUP(H21,'Instructions et définitions'!$T$7:$V$18,3,FALSE),\"\")","v":""},null,null,null,null,"",null,null,"",null,null,null,"",null,null,"",""]
[null,16,false,null,null,null,false,"",{"$f":"VLOOKUP(H22,'Instructions et définitions'!$T$7:$W$18,4,FALSE)","v":{"$error":"#N/A"}},"",null,{"$f":"IFERROR(VLOOKUP(H22,'Instructions et définitions'!$T$7:$V$18,3,FALSE),\"\")","v":""},null,null,null,null,"",null,null,"",null,null,null,"",null,null,"",""]
[null,17,false,null,null,null,false,"",{"$f":"VLOOKUP(H23,'Instructions et définitions'!$T$7:$W$18,4,FALSE)","v":{"$error":"#N/A"}},"",null,{"$f":"IFERROR(VLOOKUP(H23,'Instructions et définitions'!$T$7:$V$18,3,FALSE),\"\")","v":""},null,null,null,null,"",null,null,"",null,null,null,"",null,null,"",""]
[null,18,false,null,null,null,false,"",{"$f":"VLOOKUP(H24,'Instructions et définitions'!$T$7:$W$18,4,FALSE)","v":{"$error":"#N/A"}},"",null,{"$f":"IFERROR(VLOOKUP(H24,'Instructions et définitions'!$T$7:$V$18,3,FALSE),\"\")","v":""},null,null,null,null,"",null,null,"",null,null,null,"",null,null,"",""]
[null,19,false,null,null,null,false,"",{"$f":"VLOOKUP(H25,'Instructions et définitions'!$T$7:$W$18,4,FALSE)","v":{"$error":"#N/A"}},"",null,{"$f":"IFERROR(VLOOKUP(H25,'Instructions et définitions'!$T$7:$V$18,3,FALSE),\"\")","v":""},null,null,null,null,"",null,null,"",null,null,null,"",null,null,"",""]
[null,20,false,null,null,null,false,"",{"$f":"VLOOKUP(H26,'Instructions et définitions'!$T$7:$W$18,4,FALSE)","v":{"$error":"#N/A"}},"",null,{"$f":"IFERROR(VLOOKUP(H26,'Instructions et définitions'!$T$7:$V$18,3,FALSE),\"\")","v":""},null,null,null,null,"",null,null,"",null,null,null,"",null,null,"",""]
[null,21,false,null,null,null,false,"",{"$f":"VLOOKUP(H27,'Instructions et définitions'!$T$7:$W$18,4,FALSE)","v":{"$error":"#N/A"}},"",null,{"$f":"IFERROR(VLOOKUP(H27,'Instructions et définitions'!$T$7:$V$18,3,FALSE),\"\")","v":""},null,null,null,null,"",null,null,"",null,null,null,"",null,null,"",""]
[null,22,false,null,null,null,false,"",{"$f":"VLOOKUP(H28,'Instructions et définitions'!$T$7:$W$18,4,FALSE)","v":{"$error":"#N/A"}},"",null,{"$f":"IFERROR(VLOOKUP(H28,'Instructions et définitions'!$T$7:$V$18,3,FALSE),\"\")","v":""},null,null,null,null,"",null,null,"",null,null,null,"",null,null,"",""]
[null,23,false,null,null,null,false,"",{"$f":"VLOOKUP(H29,'Instructions et définitions'!$T$7:$W$18,4,FALSE)","v":{"$error":"#N/A"}},"",null,{"$f":"IFERROR(VLOOKUP(H29,'Instructions et définitions'!$T$7:$V$18,3,FALSE),\"\")","v":""},null,null,null,null,"",null,null,"",null,null,null,"",null,null,"",""]
[null,24,false,null,null,null,false,"",{"$f":"VLOOKUP(H30,'Instructions et définitions'!$T$7:$W$18,4,FALSE)","v":{"$error":"#N/A"}},"",null,{"$f":"IFERROR(VLOOKUP(H30,'Instructions et définitions'!$T$7:$V$18,3,FALSE),\"\")","v":""},null,null,null,null,"",null,null,"",null,null,null,"",null,null,"",""]
[null,25,false,null,null,null,false,"",{"$f":"VLOOKUP(H31,'Instructions et définitions'!$T$7:$W$18,4,FALSE)","v":{"$error":"#N/A"}},"",null,{"$f":"IFERROR(VLOOKUP(H31,'Instructions et définitions'!$T$7:$V$18,3,FALSE),\"\")","v":""},null,null,null,null,"",null,null,"",null,null,null,"",null,null,"",""]
[null,26,false,null,null,null,false,"",{"$f":"VLOOKUP(H32,'Instructions et définitions'!$T$7:$W$18,4,FALSE)","v":{"$error":"#N/A"}},"",null,{"$f":"IFERROR(VLOOKUP(H32,'Instructions et définitions'!$T$7:$V$18,3,FALSE),\"\")","v":""},null,null,null,null,"",null,null,"",null,null,null,"",null,null,"",""]
[null,27,false,null,null,null,false,"",{"$f":"VLOOKUP(H33,'Instructions et définitions'!$T$7:$W$18,4,FALSE)","v":{"$error":"#N/A"}},"",null,{"$f":"IFERROR(VLOOKUP(H33,'Instructions et définitions'!$T$7:$V$18,3,FALSE),\"\")","v":""},null,null,null,null,"",null,null,"",null,null,null,"",null,null,"",""]
[null,28,false,null,null,null,false,"",{"$f":"VLOOKUP(H34,'Instructions et définitions'!$T$7:$W$18,4,FALSE)","v":{"$error":"#N/A"}},"",null,{"$f":"IFERROR(VLOOKUP(H34,'Instructions et définitions'!$T$7:$V$18,3,FALSE),\"\")","v":""},null,null,null,null,"",null,null,"",null,null,null,"",null,null,"",""]
[null,29,false,null,null,null,false,"",{"$f":"VLOOKUP(H35,'Instructions et définitions'!$T$7:$W$18,4,FALSE)","v":{"$error":"#N/A"}},"",null,{"$f":"IFERROR(VLOOKUP(H35,'Instructions et définitions'!$T$7:$V$18,3,FALSE),\"\")","v":""},null,null,null,null,"",null,null,"",null,null,null,"",null,null,"",""]
[null,30,false,null,null,null,false,"",{"$f":"VLOOKUP(H36,'Instructions et définitions'!$T$7:$W$18,4,FALSE)","v":{"$error":"#N/A"}},"",null,{"$f":"IFERROR(VLOOKUP(H36,'Instructions et définitions'!$T$7:$V$18,3,FALSE),\"\")","v":""},null,null,null,null,"",null,null,"",null,null,null,"",null,null,"",""]
[null,31,false,null,null,null,false,"",{"$f":"VLOOKUP(H37,'Instructions et définitions'!$T$7:$W$18,4,FALSE)","v":{"$error":"#N/A"}},"",null,{"$f":"IFERROR(VLOOKUP(H37,'Instructions et définitions'!$T$7:$V$18,3,FALSE),\"\")","v":""},null,null,null,null,"",null,null,"",null,null,null,"",null,null,"",""]
[null,32,false,null,null,null,false,"",{"$f":"VLOOKUP(H38,'Instructions et définitions'!$T$7:$W$18,4,FALSE)","v":{"$error":"#N/A"}},"",null,{"$f":"IFERROR(VLOOKUP(H38,'Instructions et définitions'!$T$7:$V$18,3,FALSE),\"\")","v":""},null,null,null,null,"",null,null,"",null,null,null,"",null,null,"",""]
[null,33,false,null,null,null,false,"",{"$f":"VLOOKUP(H39,'Instructions et définitions'!$T$7:$W$18,4,FALSE)","v":{"$error":"#N/A"}},"",null,{"$f":"IFERROR(VLOOKUP(H39,'Instructions et définitions'!$T$7:$V$18,3,FALSE),\"\")","v":""},null,null,null,null,"",null,null,"",null,null,null,"",null,null,"",""]
[null,34,false,null,null,null,false,"",{"$f":"VLOOKUP(H40,'Instructions et définitions'!$T$7:$W$18,4,FALSE)","v":{"$error":"#N/A"}},"",null,{"$f":"IFERROR(VLOOKUP(H40,'Instructions et définitions'!$T$7:$V$18,3,FALSE),\"\")","v":""},null,null,null,null,"",null,null,"",null,null,null,"",null,null,"",""]
{"$rows_left_out":27}
{"sheet":"Rapports","index":2,"n_rows":3,"n_cols":18,"rows_kept":3,"cut":false,"hidden":false,"merged":[]}
[]
[]
[null,null,null,null,null,null,null,null,null,null,null,null,null,null,null,null,null,"Conseils"]

{"sheet":"TDC","index":3,"n_rows":13,"n_cols":37,"rows_kept":13,"cut":false,"hidden":true,"merged":[]}
[]
[null,"Graph2"]
[null,"Année","(Tous)",null,null,null,null,null,"Graph3",null,null,null,null,null,null,"Graph4",null,null,null,null,null,null,"Graph 5"]
[null,null,null,null,null,null,null,null,null,null,null,null,null,null,null,null,null,null,null,null,null,null,null,null,null,null,null,null,"Graph1",null,null,null,null,null,"Graph 6"]
[null,"Étiquettes de lignes"," Taux gestation (brebis)"," Taux gestation (agnelles)"," Taux gestation (brebis transférées)"," Taux gestation (agnelles transférées)",null,null,"Étiquettes de lignes"," Taux gestation (brebis)"," Taux gestation (agnelles)"," Taux gestation (brebis transférées)"," Taux gestation (agnelles transférées)",null,null,"Saison","CS",null,null,null,null,null,"Saison","CS",null,null,null,null,"C'est un champs calculé"]
[null,"Contre-saison",0.92,0.95833333333333337,0.8,0.5,null,null,"Contre-saison",0.92,0.95833333333333337,0.8,0.5]
[null,"RV",0.92,0.95833333333333337,0.8,0.5,null,null,"RV",null,null,null,null,null,null,"Étiquettes de lignes"," Taux gestation (brebis)"," Taux gestation (agnelles)"," Taux gestation (brebis transférées)"," Taux gestation (agnelles transférées)",null,null,"Étiquettes de lignes"," Taux gestation (brebis)"," Taux gestation (agnelles)"," Taux gestation (brebis transférées)"," Taux gestation (agnelles transférées)",null,"Moyenne de Moyenne taux gestation tous (sur nombre)","Étiquettes de colonnes",null,null,null,null,"Année","(Tous)"]
[null,"Total général",0.92,0.95833333333333337,0.8,0.5,null,null,2019,0.92,0.95833333333333337,0.8,0.5,null,null,"Avril",null,null,null,null,null,null,"Avril",null,null,null,null,null,"Étiquettes de lignes","Contre-saison","Total général"]
[null,null,null,null,null,null,null,null,"Total général",0.92,0.95833333333333337,0.8,0.5,null,null,"RV",0.92,0.95833333333333337,0.8,0.5,null,null,"RV",null,null,null,null,null,2019,null,null,null,null,null,"Étiquettes de lignes"," Taux gestation (brebis transférées)"," Taux gestation (agnelles transférées)"]
[null,null,null,null,null,null,null,null,null,null,null,null,null,null,null,"Total général",0.92,0.95833333333333337,0.8,0.5,null,null,2019,0.92,0.95833333333333337,0.8,0.5,null,"RV",0.90350877192982459,0.90350877192982459,null,null,null,"Contre-saison",0.8,0.5]
[null,null,null,null,null,null,null,null,null,null,null,null,null,null,null,null,null,null,null,null,null,null,"Total général",0.92,0.95833333333333337,0.8,0.5,null,"Total général",0.90350877192982459,0.90350877192982459,null,null,null,"RV"]
[null,null,null,null,null,null,null,null,null,null,null,null,null,null,null,null,null,null,null,null,null,null,null,null,null,null,null,null,null,null,null,null,null,null,"CIDR",0.8,0.5]
[null,null,null,null,null,null,null,null,null,null,null,null,null,null,null,null,null,null,null,null,null,null,null,null,null,null,null,null,null,null,null,null,null,null,"Total général",0.8,0.5]